All Projects

IDCategoryTask TypePrioritySeveritySummaryStatusProgressAssigned ToOpened by
18Backend / CoreFeature RequestMediumLowPlease make sure edit package New
90%
Toni ArisandiZee Eichel Task Description

We need edit package for revision, and also please no need to make a new package when revision updating

Please check and make sure function running well, thx

17Backend / CoreBug ReportMediumLowNo delete functionNew
100%
Toni ArisandiZee Eichel Task Description

no need delete function for packaging.

16Default PackagesBug ReportVery HighCriticallibgtk-x11-2.0.soAssigned
0%
Zee EichelZee Eichel Task Description

Error showing when compiling firefox and libreoffice

libgtk-x11-2.0.so: file not recognized: File truncated
collect2: error: ld returned 1 exit status
15Default PackagesFeature RequestMediumLowDHCP-4.3.4 Requires testing
100%
Zee EichelZee Eichel Task Description

The ISC DHCP package contains both the client and server programs for DHCP. dhclient (the client) is used for connecting to a network which uses DHCP to assign network addresses. dhcpd (the server) is used for assigning network addresses on private networks.

14Default ToolsBug ReportVery HighCriticalBulk ExtractorAssigned
0%
purnomo hadiZee Eichel Task Description
return libewf_read_random(handle,buf,bytes,offset);
                                                      ^
make[2]: *** [Makefile:970: image_process.o] Error 1
make[2]: Leaving directory '/root/bulk_extractor/src'
make[1]: *** [Makefile:465: all-recursive] Error 1
make[1]: Leaving directory '/root/bulk_extractor'
make: *** [Makefile:404: all] Error 2
13Default ToolsFeature RequestVery HighCriticalU3pwn-2.0New
0%
fachrizal oktavianZee Eichel Task Description

fix link /usr/bin

12Default ToolsBug ReportVery HighCriticalInguma-0.1.1New
0%
fachrizal oktavianZee Eichel Task Description

fix ln at /usr/bin

11Default ToolsBug ReportVery HighCriticalSslyze-1.1.1 Assigned
0%
fachrizal oktavianZee Eichel Task Description
FAIL: test_optional_fields (ocsp_response_tests.OcspResponseOnlineTests)
----------------------------------------------------------------------
Traceback (most recent call last):
  File "/root/sslyze-master/nassl/tests/ocsp_response_tests.py", line 87, in test_optional_fields
    self.assertIsNone(ocsp_response.as_dict()['responses'][0]['nextUpdate'])
AssertionError: u'Jul 25 08:08:49 2017 GMT' is not None

----------------------------------------------------------------------
Ran 79 tests in 9.737s

FAILED (failures=1)
Test failed: 
error: Test failed: 
Traceback (most recent call last):
  File "build_from_scratch.py", line 164, in 
    main()
  File "build_from_scratch.py", line 156, in main
    perform_build_task('NASSL Tests', NASSL_TEST_TASKS)
  File "build_from_scratch.py", line 34, in perform_build_task
    subprocess.check_call(command, shell=True, cwd=cwd)
  File "/usr/lib/python2.7/subprocess.py", line 541, in check_call
    raise CalledProcessError(retcode, cmd)
subprocess.CalledProcessError: Command '/usr/bin/python setup.py test' returned non-zero exit status 1
10Default PackagesBug ReportVery HighCriticalweston-1.11.0 Waiting for Feedback
100%
purnomo hadiZee Eichel Task Description
make[1]: Entering directory '/root/weston-1.11.0'
  CC       src/gl_renderer_la-gl-renderer.lo
  CC       src/gl_renderer_la-vertex-clipping.lo
  CCLD     gl-renderer.la
/usr/lib/libEGL.so: file not recognized: File format not recognized
collect2: error: ld returned 1 exit status
make[1]: *** [Makefile:3199: gl-renderer.la] Error 1
make[1]: Leaving directory '/root/weston-1.11.0'
make: *** [Makefile:3002: all] Error 2
9Default ToolsBug ReportVery HighCriticalCapAnalysisAssigned
0%
fachrizal oktavianZee Eichel Task Description

Affected 32 and 64 bit

8Default ToolsBug ReportVery HighCriticalXplicoAssigned
0%
purnomo hadiEdo Maland Task Description

Affected 32 and 64 bit

6Default ToolsBug ReportVery HighCriticalSamdump2Assigned
0%
purnomo hadiEdo Maland Task Description

affected 32 & 64 bit

5Default ToolsBug ReportVery HighCriticalVolatilityBotAssigned
0%
purnomo hadiEdo Maland Task Description

Affected 32 and 64 bit

4Default ToolsBug ReportVery HighCriticalewfacquireAssigned
0%
purnomo hadiEdo Maland Task Description

affected 32 and 64 bit

3Default ToolsBug ReportVery HighCriticalewfmountAssigned
0%
purnomo hadiEdo Maland Task Description

Fix

affected 32 & 64 bit

2Default ToolsFeature RequestVery HighCriticalU3pwn-2.0Assigned
0%
fachrizal oktavianEdo Maland Task Description

Fix prefix

affected : 64 bit & 32 bit

1Default ToolsFeature RequestVery HighCriticalInguma-0.1.1Researching
0%
fachrizal oktavianZee Eichel Task Description

affected to 32 and 64 bit

Fix prefix

Showing tasks 1 - 17 of 17 Page 1 of 1

Available keyboard shortcuts

  • SHIFT+ALT+l Login Dialog / Logout
  • SHIFT+ALT+a Add new task
  • SHIFT+ALT+m My searches
  • SHIFT+ALT+t focus taskid search

Tasklist

  • o open selected task
  • j move cursor down
  • k move cursor up

Task Details

  • n Next task
  • p Previous task
  • SHIFT+ALT+e ENTER Edit this task
  • SHIFT+ALT+y Close Task

Task Editing

  • SHIFT+ALT+s save task