All Projects

IDCategoryTask TypePrioritySeveritySummaryStatusProgressAssigned ToOpened by
13Default ToolsFeature RequestVery HighCriticalU3pwn-2.0New
0%
fachrizal oktavianZee Eichel Task Description

fix link /usr/bin

12Default ToolsBug ReportVery HighCriticalInguma-0.1.1New
0%
fachrizal oktavianZee Eichel Task Description

fix ln at /usr/bin

11Default ToolsBug ReportVery HighCriticalSslyze-1.1.1 Assigned
0%
fachrizal oktavianZee Eichel Task Description
FAIL: test_optional_fields (ocsp_response_tests.OcspResponseOnlineTests)
----------------------------------------------------------------------
Traceback (most recent call last):
  File "/root/sslyze-master/nassl/tests/ocsp_response_tests.py", line 87, in test_optional_fields
    self.assertIsNone(ocsp_response.as_dict()['responses'][0]['nextUpdate'])
AssertionError: u'Jul 25 08:08:49 2017 GMT' is not None

----------------------------------------------------------------------
Ran 79 tests in 9.737s

FAILED (failures=1)
Test failed: 
error: Test failed: 
Traceback (most recent call last):
  File "build_from_scratch.py", line 164, in 
    main()
  File "build_from_scratch.py", line 156, in main
    perform_build_task('NASSL Tests', NASSL_TEST_TASKS)
  File "build_from_scratch.py", line 34, in perform_build_task
    subprocess.check_call(command, shell=True, cwd=cwd)
  File "/usr/lib/python2.7/subprocess.py", line 541, in check_call
    raise CalledProcessError(retcode, cmd)
subprocess.CalledProcessError: Command '/usr/bin/python setup.py test' returned non-zero exit status 1
9Default ToolsBug ReportVery HighCriticalCapAnalysisAssigned
0%
fachrizal oktavianZee Eichel Task Description

Affected 32 and 64 bit

2Default ToolsFeature RequestVery HighCriticalU3pwn-2.0Assigned
0%
fachrizal oktavianEdo Maland Task Description

Fix prefix

affected : 64 bit & 32 bit

1Default ToolsFeature RequestVery HighCriticalInguma-0.1.1Researching
0%
fachrizal oktavianZee Eichel Task Description

affected to 32 and 64 bit

Fix prefix

Showing tasks 1 - 6 of 6 Page 1 of 1

Available keyboard shortcuts

  • SHIFT+ALT+l Login Dialog / Logout
  • SHIFT+ALT+a Add new task
  • SHIFT+ALT+m My searches
  • SHIFT+ALT+t focus taskid search

Tasklist

  • o open selected task
  • j move cursor down
  • k move cursor up

Task Details

  • n Next task
  • p Previous task
  • SHIFT+ALT+e ENTER Edit this task
  • SHIFT+ALT+y Close Task

Task Editing

  • SHIFT+ALT+s save task