dracos linux

  • Status Assigned
  • Percent Complete
    0%
  • Task Type Bug Report
  • Category Default Tools
  • Assigned To
    fachrizal oktavian
  • Operating System 32 bit
  • Severity Critical
  • Priority Very High
  • Reported Version 3.0-beta codename kuntilanak
  • Due in Version Undecided
  • Due Date Undecided
  • Votes
  • Private
Attached to Project: dracos linux
Opened by Zee Eichel - 24.07.2017
Last edited by Zee Eichel - 31.07.2017

FS#11 - Sslyze-1.1.1

FAIL: test_optional_fields (ocsp_response_tests.OcspResponseOnlineTests)
----------------------------------------------------------------------
Traceback (most recent call last):
  File "/root/sslyze-master/nassl/tests/ocsp_response_tests.py", line 87, in test_optional_fields
    self.assertIsNone(ocsp_response.as_dict()['responses'][0]['nextUpdate'])
AssertionError: u'Jul 25 08:08:49 2017 GMT' is not None

----------------------------------------------------------------------
Ran 79 tests in 9.737s

FAILED (failures=1)
Test failed: 
error: Test failed: 
Traceback (most recent call last):
  File "build_from_scratch.py", line 164, in 
    main()
  File "build_from_scratch.py", line 156, in main
    perform_build_task('NASSL Tests', NASSL_TEST_TASKS)
  File "build_from_scratch.py", line 34, in perform_build_task
    subprocess.check_call(command, shell=True, cwd=cwd)
  File "/usr/lib/python2.7/subprocess.py", line 541, in check_call
    raise CalledProcessError(retcode, cmd)
subprocess.CalledProcessError: Command '/usr/bin/python setup.py test' returned non-zero exit status 1

Loading...

Available keyboard shortcuts

Tasklist

Task Details

Task Editing